Fire hazard
preferred label: خطر آتش‌سوزی @fa
type: Concept
narrower: Fire load

Fire load
scope note: The total amount of combustible material expressed in heat units.
scope note: مقدار مواد قابل اشتعال در هر فوت مربع (0/305 متر) از زیربنای ساختمان یا مقدار کل مواد قابل ‌اشتعال موجود در واحدهای حرارتی. @fa
broader: Fire hazard
preferred label: بار آتش @fa
type: Concept