Major hazard
scope note: Hazardous activities with a potential for causing more than a few fatalities at once, especially among people who are not employees of the plant.
scope note: فعالیت‌هایی که توانایی آن را دارند که موجب وارد ساختن تلفات آنی چندی به‌ویژه به کسانی شوند که در کارخانه کار می‌کنند، مثل کارخانه‌های فراوری شیمیایی. @fa
broader: Hazard
preferred label: خطر بزرگ @fa
type: Concept

Hazard
preferred label: خطر @fa
type: Concept
narrower: Major hazard