Hazard management
scope note: Management strategies to reduce the impact of hazards on the community.
scope note: مدیریت راهبردی برای کاهش اثر خطرها بر جامعه. @fa
related: Incident management
broader: Hazard
preferred label: مدیریت خطر @fa
type: Concept

Incident management
preferred label: مدیریت واقعه @fa
type: Concept
related: Hazard management

Hazard
preferred label: خطر @fa
type: Concept
narrower: Hazard management