Flood control
preferred label: سیل‌بندی @fa
type: Concept
related: Flood hydrograph

Flood hydrograph
scope note: A graphical representation of the flood discharge with respect to time for a particular point on a stream or river.
scope note: نمایش گرافیکی تخلیه سیلاب با توجه به زمان آن برای نقطه خاصی از یک چشمه یا رود. @fa
related: Hydrography
related: Flood control
preferred label: آب‌نگاشت سیل @fa
type: Concept

Hydrography
preferred label: آب‌نگاری @fa
type: Concept
related: Flood hydrograph