خشکسالی
related: ال نینو
related: پیش‌بینی خشکسالی
related: امداد خشکسالی
related: قحطی
related: اقلیم
scope note: A long period of abnormally low rainfall, especially one that adversely affects growing or living conditions. @en
scope note: دوره‌ای که بارش آن کمتر از میانگین دراز مدت است . موارد مهم در بررسی خشکسالی عبارتند از: شدت خشکسالی، تداوم خشکسالی، خشکسالی در فصل نیاز به آب به‌ویژه در زمان روئیدن گیاهان.
type: Concept
preferred label: Drought @en
alternative label: بی‌بارشی

قحطی
preferred label: Famine @en
type: Concept
related: خشکسالی

امداد خشکسالی
preferred label: Drought relief @en
type: Concept
related: خشکسالی

پیش‌بینی خشکسالی
preferred label: Drought forecast @en
type: Concept
related: خشکسالی

اقلیم
preferred label: Climate @en
type: Concept
related: خشکسالی

ال نینو
preferred label: El Nino @en
type: Concept
related: خشکسالی