تنش
preferred label: Stress @en
type: Concept
related: خستگی

خستگی
scope note: کاهش توانایی کار که نتیجه تلاش‌های قبلی فرد است یا حالت درونی حاصل از تلاش طولانی و احساس بی‌رمقی و فقدان انرژی.
related: تنش
preferred label: Fatigue @en
type: Concept