Reservoir
preferred label: مخزن (تودۀ آب) @fa
type: Concept
related: Weir

Weir
scope note: A small overflow-type dam commonly used to raise the level of a small river or stream.
scope note: مانع نسبتاً کوتاه که در عرض یک رودخانه برای تنظیم ارتفاع سطح آب یا برای انحراف تمام یا قسمتی از جریان و یا برای اندازه‌گیری جریان ایجاد می‌شود. @fa
related: Barrage
related: Reservoir
related: Dam
preferred label: آب‌بند (سرریزشونده) @fa
type: Concept

Barrage
preferred label: سد دریچه‌دار @fa
type: Concept
related: Weir

Dam
preferred label: سد @fa
type: Concept
related: Weir