Dam failure
scope note: The uncontrolled release of the contents of dams through collapse of the dam or some part of it, or the inability of a dam to perform function such as water supply, prevention of excessive seepage or containment of hazardous substances.
scope note: باز شدن اجزای سد در پی فروریزی سد یا قسمتی از آن یا عدم توانایی سد در امر ذخیره آب. @fa
narrower: Dam failure warning system
related: Dam collapse
broader: Failure
preferred label: خرابی سد @fa
type: Concept

Failure
preferred label: خرابی @fa
type: Concept
narrower: Dam failure

Dam failure warning system
preferred label: سیستم هشداردهی خرابی سد @fa
type: Concept
broader: Dam failure

Dam collapse
preferred label: فروریزش سد @fa
type: Concept
related: Dam failure