Psychological services
scope note: The specific forms of assistance, ranging from initial support through to longer term clinical treatment, provided by trained personnel within this framework.
scope note: خدمات روان‌پزشکی به صورت‌های مختلف، از حمایتهای ساده تا درمانهای بلندمدت بالینی که توسط کارکنان آموزش دیده ارائه می‌شود. @fa
related: Psychological stress
related: Psychological debriefing
related: Psychological assessment
preferred label: خدمات روان‌پزشکی @fa
type: Concept

Psychological stress
preferred label: تنش روانی @fa
type: Concept
related: Psychological services

Psychological assessment
preferred label: ارزیابی روان‌شناختی @fa
type: Concept
related: Psychological services

Psychological debriefing
preferred label: آگاه‌سازی روان‌شناختی @fa
type: Concept
related: Psychological services