تنش واقعه سرنوشت‌ساز
preferred label: Critical incident stress @en
type: Concept
related: کنترل تنش واقعه سرنوشت‌ساز

کنترل تنش واقعه سرنوشت‌ساز
scope note: فرایند تضمین خدمات فوریتی رفاهی و قابلیت‌های کارکنان.
related: تنش واقعه سرنوشت‌ساز
preferred label: Critical incident stress management @en
type: Concept