Disease
preferred label: بیماری @fa
type: Concept
related: Disease control

Disease control
scope note: All policies, precautions and measures taken to prevent the outbreak or spread of communicable diseases.
scope note: خط مشی‌ها و اقدامات انجام گرفته برای جلوگیری از شیوع یا گسترش بیماری‌های مسری. @fa
related: Disease
preferred label: کنترل بیماری @fa
type: Concept