کپسول آتش‌نشانی
alternative label: کپسول آتش‌نشان
scope note: An active fire protection device used to extinguish or control small fires, often in emergency situations @en
broader: خاموش‌کننده
preferred label: Fire Extinguisher @en
type: Concept

خاموش‌کننده
preferred label: Extinguishant @en
type: Concept
narrower: کپسول آتش‌نشانی