خاکریز سیل‌بند
preferred label: Levee @en
type: Concept
narrower: دیواره آب‌بند

دیواره آب‌بند
alternative label: دایک
scope note: Wall or Embankment Protecting lowland from being flooded. @en
scope note: خاکریز کم ارتفاع و طویلی است که ارتفاع آن معمولاً کمتر از 4 یا 5 متر و طول آن به‌طور متوسط 10 تا 15 برابر ارتفاع آن است.
broader: خاکریز سیل‌بند
preferred label: Dike @en
type: Concept