کمک و یاری متقابل
scope note: تعاون و همکاری متقابل در صورت نیاز و براساس تنطیم موافقتنامه.
related: برنامه مدیریت وضع اضطراری
preferred label: Mutual aid and assistance @en
type: Concept

برنامه مدیریت وضع اضطراری
preferred label: Emergency management plan @en
type: Concept
related: کمک و یاری متقابل