Emergency management
preferred label: مدیریت وضع اضطراری @fa
type: Concept
related: Emergency management measures

Emergency management measures
alternative label: Emergency measure
scope note: Measures encompassing the assessment, corrective and protective actions taken during the course of an emergency condition.
scope note: اقداماتی شامل ارزیابی، فعالیت‌های اصلاحی و حفاظتی که در شرایط اضطراری اتخاذ می‌شود. @fa
related: Emergency management
preferred label: اقدامات مدیریت وضع اضطراری @fa
type: Concept