Boat and boating
preferred label: قایق و قایق‌سواری @fa
type: Concept
narrower: Fire boat

Fire boat
scope note: Powered vessels equipped for fighting fires.
scope note: قایق‌های قدرتی مجهز برای ارائه خدمات آتش‌نشانی. @fa
related: Fire engine
broader: Boat and boating
preferred label: قایق آتش‌نشانی @fa
type: Concept

Fire engine
preferred label: ماشین آتش‌نشانی @fa
type: Concept
related: Fire boat