حقوق مدنی
scope note: حق حیات، حق آزادی و امنیت شخصی، حق بیان و اجتماع با افراد دیگر، حق مالک شدن و عقد قرارداد، ازدواج و حق ترافع قضایی و مانند اینها.
related: وضع اضطراری کشوری
preferred label: Civil rights @en
type: Concept

وضع اضطراری کشوری
preferred label: Civil emergency @en
type: Concept
related: حقوق مدنی