Business
preferred label: کسب و کار @fa
type: Concept
narrower: Business recovery

Small business
preferred label: کسب و کار کوچک @fa
type: Concept
related: Business recovery

Business recovery
scope note: Techniques and management principles to reduce the consequences of an event and return the business to an acceptable level of functioning.
scope note: فنون و اصول مدیریتی با هدف کاهش نتایج یک حادثه و بازگرداندن کسب و کار به سطح قابل قبول و عملی. @fa
related: Small business
broader: Business
preferred label: بهسازی کسب و کار @fa
type: Concept