Monitoring
preferred label: پایش @fa
type: Concept
related: Disaster assessment

Reconnaissance
preferred label: شناسایی مقدماتی @fa
type: Concept
related: Disaster assessment

Assessment center
preferred label: مرکز ارزیابی @fa
type: Concept
related: Disaster assessment

Disaster assessment
scope note: Survey of real or potential disaster to estimate actual or expected damages and to make recommendations for prevention, preparedness and response.
scope note: بررسی فاجعه واقعی یا احتمالی برای برآورد آسیب دقیق یا تقریبی و با هدف ارائه پیشنهاداتی به منظور پیشگیری، آمادگی و واکنش نسبت به آن. @fa
related: Reconnaissance
related: Assessment center
related: Monitoring
preferred label: ارزیابی فاجعه @fa
type: Concept