Damage assessment
preferred label: ارزیابی خسارت @fa
type: Concept
narrower: Damage classification

Damage classification
scope note: Evaluation and recording of damage to structures facilities or objects according to categories of "severe damage', 'moderate damage' and 'light damage'.
scope note: ارزیابی و ثبت آسیب وارده به تسهیلات سازه‌ها یا اشیاء طبق مقوله‌های آسیب شدید، آسیب ملایم، آسیب خفیف. @fa
broader: Damage assessment
preferred label: طبقه‌بندی خسارت @fa
type: Concept