کارحرفه‌ای ناقص
alternative label: کژکاری
scope note: عدم ارائه خدمات حرفه‌ای با چنان سطحی از مهارت و دانش که معمولاً تحت شرایط مطرح شده، توسط عضو متوسطی ازصاحبان آن حرفه نشان داده می‌شود و در نتیجه وارد شدن صدمه یا ضرر یا خسارت به دریافت‌کنندگان آن خدمات یا کسانی که ذی‌حق هستند تا به آن خدمات اتکا کنند، می‌گردد. این اصطلاح بیشتر در ارتباط با فعالیت پزشکان، وکلا و حسابداران به کار می‌رود.
related: مسامحه
related: مسئولیت
preferred label: Malpractice @en
type: Concept

مسامحه
preferred label: Negligence @en
type: Concept
related: کارحرفه‌ای ناقص

مسئولیت
preferred label: Liability @en
type: Concept
related: کارحرفه‌ای ناقص