Quarantine
scope note: Legal restrictions imposed on a place or trace of land by the serving of a notice and limiting access or egress of specified animals, persons or things.
scope note: دوره‌ای که در آن مسافرینی را که از نقاط مشکوک و آلوده می‌آیند در محلی نگهداری می‌کنند، معطل کردن و جلوگیری و جداسازی موقت اشخاص به منظور بازرسی بهداشتی، محدودیت‌هایی که در مدخل یا محل خروج محل یا ساختمانی که در آن موردی از بیماری واگیر وجود دارد برای ورود و خروج قائل می‌شوند. @fa
related: Zoonosis
related: Public health
related: Exotic animal disease
preferred label: قرنطینه @fa
type: Concept

Exotic animal disease
preferred label: بیماری حیوانی غیربومی @fa
type: Concept
related: Quarantine

Zoonosis
preferred label: بیماری مشترک انسان و حیوان @fa
type: Concept
related: Quarantine

Public health
preferred label: بهداشت عمومی @fa
type: Concept
related: Quarantine