قتل
scope note: قتل غیرقانونی و عمد (اعم از اینکه با آتش‌سوزی، ضرب، سم یا هر وسیله دیگری باشد) که مسبوق به سابقه دشمنی و با نقشه قبلی و قاتل، ممیّز و عاقل باشد نه دیوانه و مقتول چنین نباشد و کشور در حال صلح باشد و نه در جنگ.
narrower: کشتار جمعی
preferred label: Murder @en
type: Concept

کشتار جمعی
preferred label: Mass murder @en
type: Concept
broader: قتل