جستجو و نجات
alternative label: نجات و کاوش
scope note: The process of locating and recovering disaster victims and the application of first aid and basic medical assistance as may be required. @en
scope note: شناسایی محل آسیب‌دیدگان که ممکن است گیرکرده و یا در محل کاملاً بسته و مجزا قرار گرفته باشند و خارج کردن آنها و قرار دادن در محل امن همراه با مواظبت‌های پزشکی.
narrower: عملیات جستجو و نجات
preferred label: Search and rescue @en
type: Concept

عملیات جستجو و نجات
preferred label: Search and rescue operations @en
type: Concept
broader: جستجو و نجات