جستجو
scope note: کوشش برای پیدا کردن افراد سالم یا آسیب دیده و مصدوم که در شرایط خاصی محبوس یا ناپدید شده‌اند.
narrower: عملیات جستجو
preferred label: Search @en
type: Concept

عملیات جستجو
preferred label: Search operations @en
type: Concept
broader: جستجو