Fuel load
scope note: The amount of fuel available to burn (depends on the type of vegetation, how much of it there is, its "fineness" and its moisture content).
scope note: میزان سوخت قابل اشتعال که به نوع پوشش گیاهی، مقدار موجود ، کیفیت و میزان رطوبت آن بستگی دارد. @fa
broader: Fire risk
preferred label: بار سوخت @fa
type: Concept

Fire risk
preferred label: احتمال خطر آتش‌سوزی @fa
type: Concept
narrower: Fuel load