خلیج فارس
preferred label: Persian Gulf @en
type: Concept
related: جزیره‌نشینان خلیج فارس

جزیره‌نشینان خلیج فارس
scope note: جزیره‌نشینان جزایر ایرانی خلیج فارس از جمله: تنب کوچک، تنب بزرگ، ابوموسی، خارک، خارکو، سیری، شتور، فارسی، فرور بزرگ، قشم، کیش، لارک، لاوان، هرمز، هنگام، هندرابی.
related: خلیج فارس
preferred label: Persian Gulf islanders @en
type: Concept