Individual risk
preferred label: احتمال خطر فردی @fa
type: Concept
related: Societal risk

Risk
preferred label: احتمال خطر @fa
type: Concept
narrower: Societal risk

Societal risk
scope note: The risk of a number of fatalities occurring. The societal risk concept is based on the premise that society is more concerned with incidents which kill a larger number of people than incidents which kill fewer numbers.
scope note: احتمال خطر وارد آمدن تلفات اجتماعی یا به تعداد زیاد در جریان یک واقعه. @fa
related: Group risk
related: Individual risk
broader: Risk
preferred label: احتمال خطر اجتماعی @fa
type: Concept

Group risk
preferred label: احتمال خطر گروهی @fa
type: Concept
related: Societal risk