Risk
preferred label: احتمال خطر @fa
type: Concept
narrower: Negligible risk

Negligible risk
scope note: Risks that are so small that there is no cause for concern about them, and no reason to take action to reduce them.
scope note: احتمال خطر به قدری کوچک و جزئی که می‌توان از آن چشم پوشی کرد و اقدامی برای کاهش آن انجام نداد. @fa
related: Insurance
broader: Risk
preferred label: احتمال خطر قابل گذشت @fa
type: Concept

Insurance
preferred label: بیمه @fa
type: Concept
related: Negligible risk