احتمال خطر
preferred label: Risk @en
type: Concept
narrower: ارزیابی احتمال خطر

ارزیابی احتمال خطر
alternative label: ارزیابی خطرپذیری
scope note: The process used to determine risk management priorities by evaluating and comparing the level of risk against predetermined standards, target risk levels or other criteria. @en
scope note: مدیریت احتمال خطر به معنی کاهش تهدید به حیات و اموال انسان و محیط است. احتمال خطر به واسطه محاسبه کمیتی کامل و مرکب - و اگر لازم باشد کیفی- ارزیابی می‌شود و پس از آن مدیریت آغاز می‌شود. ارزیابی احتمال خطر چنان مفهوم پیچیده‌ای است که تنها یک راه حل علمی و قابل تکرار به ندرت می‌تواند همه واقعیت‌های سیاسی و اجتماعی فرایند تصمیم‌گیری رضایت‌بخش را پاسخگو باشد.
related: تجزیه و تحلیل احتمال خطر
broader: احتمال خطر
preferred label: Risk assessment @en
type: Concept

تجزیه و تحلیل احتمال خطر
preferred label: Risk analysis @en
type: Concept
related: ارزیابی احتمال خطر