چاره احتمال خطر
alternative label: تدبیر احتمال خطر
scope note: Selection and implementation of appropriate intervention strategies for dealing with risk. @en
scope note: انتخاب و اجرای راهبردهای مناسب برای برخورد با احتمال خطر. از آنجا که نمی‌توان احتمال خطر را کاملاً از بین برد تنها راه، اداره درست آن است.
broader: احتمال خطر
preferred label: Risk treatment @en
type: Concept

احتمال خطر
preferred label: Risk @en
type: Concept
narrower: چاره احتمال خطر