فروریزش
alternative label: فروریختگی
scope note: The physical deformation of a structure to the point where it no longer fulfils its intended purpose. @en
scope note: تغییر شکل فیزیکی ساختار چیزی به صورتی که دیگر قادر به انجام مقصود مورد نظر نباشد.
narrower: فروریزش ساختمان
preferred label: Collapse @en
type: Concept

فروریزش ساختمان
preferred label: Building collapse @en
type: Concept
broader: فروریزش