Control
preferred label: کنترل @fa
type: Concept
related: Command

Coordination
preferred label: هماهنگی @fa
type: Concept
related: Command

Command system
preferred label: نظام فرماندهی @fa
type: Concept
related: Command

Commander
preferred label: فرمانده @fa
type: Concept
related: Command

Command
related: Control
related: Coordination
related: Commander
related: Command system
scope note: هدایت اعضا و منابع یک سازمان در اجرای نقش و وظایف آن سازمان. وظایف فرماندهی را می‌توان به شرح زیر خلاصه کرد: آگاهی کامل از برنامه طرح شده، آگاهی کامل از شرایط حاکم، شناخت کامل گروه‌ها و کارکنان، تصمیم‌گیری اقتضایی، صدور به‌موقع فرمان، پیگیری و بررسی نتایج. @fa
scope note: The direction of members and resources of an organisation in the performance of the organisation's role and tasks.
type: Concept
preferred label: فرماندهی @fa