Commander
scope note: An officer appointed by an agency, responsible for command of their personnel.
scope note: مأموری که از سوی یک سازمان، مسئولیت فرماندهی کارکنان را به عهده می‌گیرد. @fa
related: Command
preferred label: فرمانده @fa
type: Concept

Command
preferred label: فرماندهی @fa
type: Concept
related: Commander