فرسایش خاک
scope note: فرسوده شدن و از بین رفتن قسمت بالایی خاک بر اثر عوامل فرسایش مثل آب‌های جاری، باد، باران و غیره. چرای بیش از حد حیوانات در مراتع و دستکاری‌های بشر و از بین بردن پوشش گیاهی خاک‌ها نیز باعث فرسایش خاک می‌شود.
broader: فرسایش
preferred label: Soil erosion @en
type: Concept

فرسایش
preferred label: Erosion @en
type: Concept
narrower: فرسایش خاک