Coastal erosion
preferred label: فرسایش ساحلی @fa
type: Concept
broader: Erosion

Soil erosion
preferred label: فرسایش خاک @fa
type: Concept
broader: Erosion

Erosion
scope note: Loosening or dissolving and removal of rock or soil as a result of water, ice or wind action.
scope note: تغییر و گاهی تخریب سطح زمین به دلیل عوامل گوناگون مثل آب، باد، یخ، موجودات زنده. @fa
narrower: Soil erosion
narrower: Coastal erosion
related: Desertification
preferred label: فرسایش @fa
type: Concept

Desertification
preferred label: بیابانی شدن @fa
type: Concept
related: Erosion