Field medical team
scope note: Teams of experienced doctors and nurses, usually sent from a hospital, to provide on-site assessment and emergency treatment of casulties prior to transfer. One member of each team is appointed Medical team Leader.
scope note: تیم پزشکان و پرستاران مجرب که معمولاً از سوی بیمارستان فرستاده می‌شوند تا ارزیابی و درمانهای فوریتی در محل وقوع حوادث را قبل از انتقال به بیمارستان انجام دهند. یکی از اعضای هر تیم سرپرست تیم پزشکی به شمار می‌رود. @fa
related: Emergency medical personnel
preferred label: تیم پزشکی صحرایی @fa
type: Concept

Emergency medical personnel
preferred label: کارکنان فوریت‌های پزشکی @fa
type: Concept
related: Field medical team