جنگ
preferred label: War @en
type: Concept
related: تهاجم

تهاجم
scope note: تاخت و تاز نیروهای مسلح یک کشور در مناطق مرزی کشور دیگر به قصد جنگ افروزی.
related: جنگ
preferred label: Invasion @en
type: Concept