آتش‌سوزی
preferred label: Fire @en
type: Concept
narrower: آتش‌سوزی بینابینی

آتش‌سوزی بینابینی
scope note: آتش‌سوزی جنگل و علفزار و مانند اینها که به علت شرایط آب‌وهوا یا بی‌توجهی انسان در نزدیکی سکونتگاه‌ها روی می‌دهد و آتش‌نشانان شهری و آتش‌نشانان جنگل در نقطه مشترک به مهار آن اقدام می‌کنند.
broader: آتش‌سوزی
preferred label: Interface fire @en
type: Concept