Fire
preferred label: آتش‌سوزی @fa
type: Concept
narrower: Spot fire

Spot fire
scope note: Isolated fires started ahead of the main fire by sparks, embers or other ignited material, sometimes to a distance of several kilometres.
scope note: آتش‌سوزی در کنار آتش‌سوزی اصلی به علت جرقه یا مواد آتش‌زای دیگر که گاهی در فاصله‌های چند کیلومتر دورتر هم رخ می‌دهد. @fa
broader: Fire
preferred label: آتش‌سوزی فرعی @fa
type: Concept