Tsunami
preferred label: سونامی @fa
type: Concept
related: Storm surge

Sea surge
preferred label: ضربه آبی دریا @fa
type: Concept
related: Storm surge

Storm surge
alternative label: Storm tide
preferred label: خیزاب توفان @fa
related: Sea surge
related: Tsunami
broader: Storm
type: Concept
scope note: A sudden rise of sea as a result of high winds and low atmospheric pressure; sometimes called a storm tide, storm wave, or tidal wave. Generally affects only coastal areas but may intrude some distance inland.
scope note: اوج کشندی یا جزر و مدی توفان در ساحل دریا. @fa

Storm
preferred label: توفان @fa
type: Concept
narrower: Storm surge