ابیراهی نور
type: Concept
broader: ابیراهی
preferred label: aberration of light @en
scope note: جابه‌جایی ظاهری مکان ستاره به علت متناهی بودن سرعت نور و نیز به علت ‌حرکت مداری زمین در فاصلۀ رسیدن نور به ناظر

ابیراهی
type: Concept
narrower: ابیراهی نور
preferred label: aberration @en