پادتن زی‌مایه‌وند
type: Concept
alternative label: پادتن آنزیم‌وند
broader: پادتن
preferred label: enzyme-conjugated antibody @en
scope note: پادتنی که با یک زی‌مایه پیوند اشتراکی دارد.

پادتن
type: Concept
narrower: پادتن زی‌مایه‌وند
preferred label: antibody @en