جدایش لایه‌مرزی
type: Concept
broader: جداسازی
preferred label: boundary-layer separation @en
scope note: شارشی که براثر آن در لایۀ مرزی شارش معکوس به وجود می‌آید و مواد کندشدۀ لایۀ مرزی را از جریان اصلی جدا می‌کند.

جداسازی
type: Concept
narrower: جدایش لایه‌مرزی
preferred label: separation @en