پالایش گریزانه‌ای
type: Concept
broader: گریز دادن
preferred label: centrifuge refining @en
scope note: جدایش جامدها یا ذرات ریز از حامل‌های مایع، به‌وسیلۀ گریزانه

گریز دادن
type: Concept
narrower: پالایش گریزانه‌ای
preferred label: centrifugation @en