تقطیر پیوسته
type: Concept
broader: تقطیر
preferred label: continuous distillation @en
scope note: یکی از روش‌های جدایش که در آن خوراک به‌طور پیوسته به ظرف وارد می‌شود و جوش می‌آید تا تقطیر شود.

تقطیر
type: Concept
narrower: تقطیر پیوسته
preferred label: distillation @en