تقطیر فشاری
type: Concept
broader: تقطیر
preferred label: pressure distillation @en
scope note: فرایند تقطیری که در فشاری بیشتر از فشار جوّ انجام شود

تقطیر
type: Concept
narrower: تقطیر فشاری
preferred label: distillation @en