استخراج متقاطع
type: Concept
broader: استخراج مایع‌ـ مایع
preferred label: crosscurrent extraction @en
scope note: نوعی استخراج مایع‌ـ مایع ناپیوسته که در آن حلاّل به نمونۀ موجود در قیف جداساز افزوده و سپس هم زده می‌شود تا فاز استخراجی در یک جا جمع و بیرون کشیده شود.

استخراج مایع‌ـ مایع
type: Concept
narrower: استخراج متقاطع
preferred label: liquid-liquid extraction @en