صافش چلیپایی
type: Concept
broader: صافش
preferred label: crossflow filtration @en
scope note: نوعی صافش که در آن جریان ورودی موازی سطح بستر صافی است و فقط قسمتی از جریان ورودی از داخل صافی عبور می‌کند.

صافش
type: Concept
narrower: صافش چلیپایی
preferred label: filtration @en