صافش غشایی
type: Concept
broader: صافش
preferred label: membrane filtration @en
scope note: روشی برای جدایش ذرات ریز یا ریزاندامگان‌ها از سیالات با استفاده از صافی دارای منافذی به اندازۀ مشخص

صافش
type: Concept
narrower: صافش غشایی
preferred label: filtration @en